{"text_format":"1","workbook":"xlsx","n_sheets":10,"sheets":["Sublot 1","Sublot 2","Sublot 3","Sublot 4","Sublot 5","Sublot 6","Pay Factors","Instructions","Tables","Disclaimer"],"not_rendered":{"charts":0,"images":0,"macros":1,"external_links":4,"defined_names":45,"comments":1,"pivot_tables":0},"unopened":[],"bounds":{"document_bytes":16777216,"sheet_cells":100000,"rows_first":2000,"rows_last":500,"rows_between":2000,"halvings":0,"cell_chars":16384,"cell_head_chars":4096},"cells_cut":0,"cells_raw":0,"read":"whole","date_system":"1900"}

{"sheet":"Sublot 1","index":0,"n_rows":67,"n_cols":20,"rows_kept":67,"cut":false,"hidden":false,"merged":[[10,1,10,6],[11,4,11,6],[6,6,6,8],[5,9,5,10],[7,6,7,8],[23,8,23,9],[13,8,13,12],[10,9,10,10],[11,9,11,11],[12,9,12,11],[36,8,36,9],[37,8,37,9],[55,8,55,9],[56,8,56,9],[57,8,57,9],[42,8,42,12],[40,1,40,5],[42,1,42,2],[43,1,43,2],[41,1,41,2],[27,8,27,9],[28,8,28,9],[29,8,29,9],[30,8,30,9],[31,8,31,9],[32,8,32,9],[33,8,33,9],[38,8,38,9],[39,8,39,9],[40,8,40,9],[34,8,34,9],[35,8,35,9],[30,1,30,2],[31,1,31,2],[32,1,32,2],[33,1,33,2],[38,1,38,2],[34,1,34,2],[35,1,35,2],[36,1,36,2],[37,1,37,2],[26,8,26,12],[6,1,6,4],[9,1,9,6],[0,1,0,13],[6,9,6,10],[7,9,7,10],[2,0,2,13],[7,11,7,13],[5,1,5,4],[7,1,7,4],[5,6,5,8],[5,11,5,13],[6,11,6,13],[1,0,1,13],[3,0,3,13],[24,8,24,9],[50,1,50,2],[45,1,45,5],[53,8,53,9],[54,8,54,9],[46,1,46,2],[47,1,47,2],[48,1,48,2],[49,1,49,2]]}
["v 1.14","OKLAHOMA DEPARTMENT OF TRANSPORTATION"]
["SUPERPAVE"]
["McALESTER RESIDENCY"]
["HOT MIX ASPHALT SAMPLE SHEET"]
[null,null,null,null,null,null,null,null,null,null,null,null,null,null,null,"INFORMATION FROM MIX DESIGN:"]
[" Project No.",null,null,null,null,"J.P. No.",null,null,null,"Contract No. "]
[" Contractor",null,null,null,null,"Producer",null,null,null," Plant Location "]
["SM Sample ID",null,null,null,null,"Mix Type",null,null,null,"Design No. ",null,null,null,null,"3M+","    Million ESALs or PG Grade: Select from drop-down list."]
[]
[null,"EXTRACTIONS AND GRADATIONS",null,null,null,null,null,"IOC",1000,"  TOTAL TONS for this SubLOT"]
[null,"(OHD L-26, AASHTO T-30, T-11)",null,null,null,null,null,0.18,2.6589999999999998,"  Gse from Design",null,"(Gse >= Gsb)"]
[null," Time",null,"Date",null,null,null,"Specimen Wt.",2.6120000000000001,"  Gsb from Design",null,null,null,null,"A","    Change for each sheet if A is not used on each.  Rices Precision: Select from drop-down list.  "]
[null," Temperature ",null,"Lot",1,"SubLot",1,4700,1.01,"  Spec. Grav. AC from Design",null,null,null,null,{"$f":"VLOOKUP(O12,PTable,2,FALSE)","v":1.4E-2},"    Method A - Mechanical or Method B - Manual"]
[null,"SIEVE","JMF","Acc. Wt.","Acc. %"," Total Agg.",null,null,"MAXIMUM SPECIFIC GRAVITY  (AASHTO T209)"]
[null,"SIZE",null,"Retd.","Retd."," % Passing","Dev.",null," Sub-Lot No.",null,null,null,null,null,null,"Limits",null,null,"Tolerance"]
{"$rows_left_out":53}
{"sheet":"Sublot 2","index":1,"n_rows":61,"n_cols":20,"rows_kept":61,"cut":false,"hidden":false,"merged":[[53,8,53,9],[54,8,54,9],[55,8,55,9],[48,1,48,2],[37,8,37,9],[38,8,38,9],[39,8,39,9],[40,8,40,9],[42,8,42,12],[36,8,36,9],[1,0,1,13],[2,0,2,13],[3,0,3,13],[5,1,5,4],[5,6,5,8],[5,9,5,10],[5,11,5,13],[6,1,6,4],[6,6,6,8],[6,9,6,10],[6,11,6,13],[7,1,7,4],[7,6,7,8],[7,9,7,10],[7,11,7,13],[9,1,9,6],[10,1,10,6],[10,9,10,10],[11,4,11,6],[11,9,11,11],[27,8,27,9],[29,8,29,9],[30,8,30,9],[12,9,12,11],[13,8,13,12],[23,8,23,9],[24,8,24,9],[26,8,26,12],[32,1,32,2],[33,1,33,2],[34,1,34,2],[35,1,35,2],[28,8,28,9],[30,1,30,2],[31,8,31,9],[32,8,32,9],[33,8,33,9],[34,8,34,9],[35,8,35,9],[0,1,0,13],[57,8,57,9],[56,8,56,9],[42,1,42,2],[43,1,43,2],[45,1,45,5],[46,1,46,2],[47,1,47,2],[49,1,49,2],[50,1,50,2],[36,1,36,2],[37,1,37,2],[38,1,38,2],[40,1,40,5],[41,1,41,2],[31,1,31,2]]}
[{"$f":"'Sublot 1'!A1","v":"v 1.14"},"OKLAHOMA DEPARTMENT OF TRANSPORTATION"]
["SUPERPAVE"]
[{"$f":"'Sublot 1'!A3:N3","v":"McALESTER RESIDENCY"}]
["HOT MIX ASPHALT SAMPLE SHEET"]
[null,null,null,null,null,null,null,null,null,null,null,null,null,null,null,"INFORMATION FROM MIX DESIGN:"]
[" Project No. ",{"$f":"IF('Sublot 1'!B6=\"\",\"\",'Sublot 1'!B6)","v":""},null,null,null,"J.P. No.",{"$f":"IF('Sublot 1'!G6=\"\",\"\",'Sublot 1'!G6)","v":""},null,null,"Contract No. ",null,{"$f":"IF('Sublot 1'!L6=\"\",\"\",'Sublot 1'!L6)","v":""}]
[" Contractor ",{"$f":"IF('Sublot 1'!B7=\"\",\"\",'Sublot 1'!B7)","v":""},null,null,null,"Producer",{"$f":"IF('Sublot 1'!G7=\"\",\"\",'Sublot 1'!G7)","v":""},null,null," Plant Location ",null,{"$f":"IF('Sublot 1'!L7=\"\",\"\",'Sublot 1'!L7)","v":""}]
[{"$f":"'Sublot 1'!A8","v":"SM Sample ID"},null,null,null,null,"Mix Type",{"$f":"IF('Sublot 1'!G8=\"\",\"\",'Sublot 1'!G8)","v":""},null,null,"Design No. ",null,{"$f":"IF('Sublot 1'!L8=\"\",\"\",'Sublot 1'!L8)","v":""},null,null,{"$f":"'Sublot 1'!O8","v":"3M+"},"    Million ESALs or PG Grade: Select from drop-down list."]
[]
[null,"EXTRACTIONS AND GRADATIONS",null,null,null,null,null,"IOC",1000,"  TOTAL TONS for this SubLOT"]
[null,"(OHD L-26, AASHTO T-30, T-11)",null,null,null,null,null,{"$f":"IF('Sublot 1'!H11=\"\",\"\",'Sublot 1'!H11)","v":0.18},{"$f":"'Sublot 1'!I11","v":2.6589999999999998},"  Gse from Design",null,"(Gse >= Gsb)"]
[null," Time",null,"Date",null,null,null,"Specimen Wt.",{"$f":"'Sublot 1'!I12","v":2.6120000000000001},"  Gsb from Design",null,null,null,null,"A","    Change for each sheet if A is not used on each.  Rices Precision: Select from drop-down list.  "]
[null," Temperature ",null,"Lot",{"$f":"IF('Sublot 1'!E13=\"\",\"\",'Sublot 1'!E13)","v":1},"SubLot",2,{"$f":"IF('Sublot 1'!H13=\"\",\"\",'Sublot 1'!H13)","v":4700},{"$f":"'Sublot 1'!I13","v":1.01},"  Spec. Grav. AC from Design",null,null,null,null,{"$f":"VLOOKUP(O12,PTable,2,FALSE)","v":1.4E-2},"    Method A - Mechanical or Method B - Manual"]
[null,"SIEVE","JMF","Acc. Wt.","Acc. %"," Total Agg.",null,null,"MAXIMUM SPECIFIC GRAVITY  (AASHTO T209)"]
[null,"SIZE",null,"Retd.","Retd."," % Passing","Dev.",null," Sub-Lot No.",null,null,null,null,null,null,"Limits",null,null,"Tolerance"]
{"$rows_left_out":47}
{"sheet":"Sublot 3","index":2,"n_rows":61,"n_cols":20,"rows_kept":61,"cut":false,"hidden":false,"merged":[[40,8,40,9],[57,8,57,9],[56,8,56,9],[55,8,55,9],[53,8,53,9],[54,8,54,9],[29,8,29,9],[30,8,30,9],[31,8,31,9],[32,8,32,9],[37,8,37,9],[50,1,50,2],[49,1,49,2],[33,8,33,9],[34,8,34,9],[35,8,35,9],[36,8,36,9],[41,1,41,2],[42,1,42,2],[43,1,43,2],[45,1,45,5],[46,1,46,2],[47,1,47,2],[48,1,48,2],[42,8,42,12],[38,8,38,9],[39,8,39,9],[13,8,13,12],[23,8,23,9],[24,8,24,9],[40,1,40,5],[26,8,26,12],[28,8,28,9],[30,1,30,2],[31,1,31,2],[32,1,32,2],[33,1,33,2],[34,1,34,2],[35,1,35,2],[36,1,36,2],[37,1,37,2],[38,1,38,2],[27,8,27,9],[12,9,12,11],[6,1,6,4],[6,6,6,8],[6,9,6,10],[6,11,6,13],[7,1,7,4],[7,6,7,8],[7,9,7,10],[7,11,7,13],[9,1,9,6],[10,1,10,6],[10,9,10,10],[11,4,11,6],[11,9,11,11],[0,1,0,13],[1,0,1,13],[2,0,2,13],[3,0,3,13],[5,1,5,4],[5,6,5,8],[5,9,5,10],[5,11,5,13]]}
[{"$f":"'Sublot 1'!A1","v":"v 1.14"},"OKLAHOMA DEPARTMENT OF TRANSPORTATION"]
["SUPERPAVE"]
[{"$f":"'Sublot 1'!A3:N3","v":"McALESTER RESIDENCY"}]
["HOT MIX ASPHALT SAMPLE SHEET"]
[null,null,null,null,null,null,null,null,null,null,null,null,null,null,null,"INFORMATION FROM MIX DESIGN:"]
[" Project No. ",{"$f":"IF('Sublot 1'!B6=\"\",\"\",'Sublot 1'!B6)","v":""},null,null,null,"J.P. No.",{"$f":"IF('Sublot 1'!G6=\"\",\"\",'Sublot 1'!G6)","v":""},null,null,"Contract No. ",null,{"$f":"IF('Sublot 1'!L6=\"\",\"\",'Sublot 1'!L6)","v":""}]
[" Contractor ",{"$f":"IF('Sublot 1'!B7=\"\",\"\",'Sublot 1'!B7)","v":""},null,null,null,"Producer",{"$f":"IF('Sublot 1'!G7=\"\",\"\",'Sublot 1'!G7)","v":""},null,null," Plant Location ",null,{"$f":"IF('Sublot 1'!L7=\"\",\"\",'Sublot 1'!L7)","v":""}]
[{"$f":"'Sublot 1'!A8","v":"SM Sample ID"},null,null,null,null,"Mix Type",{"$f":"IF('Sublot 1'!G8=\"\",\"\",'Sublot 1'!G8)","v":""},null,null,"Design No. ",null,{"$f":"IF('Sublot 1'!L8=\"\",\"\",'Sublot 1'!L8)","v":""},null,null,{"$f":"'Sublot 1'!O8","v":"3M+"},"    Million ESALs or PG Grade: Select from drop-down list."]
[]
[null,"EXTRACTIONS AND GRADATIONS",null,null,null,null,null,"IOC",1000,"  TOTAL TONS for this SubLOT"]
[null,"(OHD L-26, AASHTO T-30, T-11)",null,null,null,null,null,{"$f":"IF('Sublot 1'!H11=\"\",\"\",'Sublot 1'!H11)","v":0.18},{"$f":"'Sublot 1'!I11","v":2.6589999999999998},"  Gse from Design",null,"(Gse >= Gsb)"]
[null," Time",null,"Date",null,null,null,"Specimen Wt.",{"$f":"'Sublot 1'!I12","v":2.6120000000000001},"  Gsb from Design",null,null,null,null,"A","    Change for each sheet if A is not used on each.  Rices Precision: Select from drop-down list.  "]
[null," Temperature ",null,"Lot",{"$f":"IF('Sublot 1'!E13=\"\",\"\",'Sublot 1'!E13)","v":1},"SubLot",3,{"$f":"IF('Sublot 1'!H13=\"\",\"\",'Sublot 1'!H13)","v":4700},{"$f":"'Sublot 1'!I13","v":1.01},"  Spec. Grav. AC from Design",null,null,null,null,{"$f":"VLOOKUP(O12,PTable,2,FALSE)","v":1.4E-2},"    Method A - Mechanical or Method B - Manual"]
[null,"SIEVE","JMF","Acc. Wt.","Acc. %"," Total Agg.",null,null,"MAXIMUM SPECIFIC GRAVITY  (AASHTO T209)"]
[null,"SIZE",null,"Retd.","Retd."," % Passing","Dev.",null," Sub-Lot No.",null,null,null,null,null,null,"Limits",null,null,"Tolerance"]
{"$rows_left_out":47}
{"sheet":"Sublot 4","index":3,"n_rows":61,"n_cols":20,"rows_kept":61,"cut":false,"hidden":false,"merged":[[57,8,57,9],[53,8,53,9],[54,8,54,9],[55,8,55,9],[56,8,56,9],[39,8,39,9],[34,8,34,9],[35,8,35,9],[36,8,36,9],[40,8,40,9],[47,1,47,2],[42,8,42,12],[48,1,48,2],[49,1,49,2],[50,1,50,2],[31,8,31,9],[32,8,32,9],[33,8,33,9],[37,8,37,9],[38,8,38,9],[31,1,31,2],[32,1,32,2],[33,1,33,2],[45,1,45,5],[46,1,46,2],[34,1,34,2],[35,1,35,2],[36,1,36,2],[37,1,37,2],[38,1,38,2],[40,1,40,5],[41,1,41,2],[42,1,42,2],[43,1,43,2],[30,1,30,2],[27,8,27,9],[29,8,29,9],[30,8,30,9],[9,1,9,6],[10,1,10,6],[10,9,10,10],[11,4,11,6],[11,9,11,11],[12,9,12,11],[13,8,13,12],[23,8,23,9],[24,8,24,9],[26,8,26,12],[28,8,28,9],[6,1,6,4],[6,6,6,8],[6,9,6,10],[6,11,6,13],[7,1,7,4],[7,6,7,8],[7,9,7,10],[7,11,7,13],[0,1,0,13],[1,0,1,13],[2,0,2,13],[3,0,3,13],[5,1,5,4],[5,6,5,8],[5,9,5,10],[5,11,5,13]]}
[{"$f":"'Sublot 1'!A1","v":"v 1.14"},"OKLAHOMA DEPARTMENT OF TRANSPORTATION"]
["SUPERPAVE"]
["McALESTER RESIDENCY"]
["HOT MIX ASPHALT SAMPLE SHEET"]
[null,null,null,null,null,null,null,null,null,null,null,null,null,null,null,"INFORMATION FROM MIX DESIGN:"]
[" Project No. ",{"$f":"IF('Sublot 1'!B6=\"\",\"\",'Sublot 1'!B6)","v":""},null,null,null,"J.P. No.",{"$f":"IF('Sublot 1'!G6=\"\",\"\",'Sublot 1'!G6)","v":""},null,null,"Contract No. ",null,{"$f":"IF('Sublot 1'!L6=\"\",\"\",'Sublot 1'!L6)","v":""}]
[" Contractor ",{"$f":"IF('Sublot 1'!B7=\"\",\"\",'Sublot 1'!B7)","v":""},null,null,null,"Producer",{"$f":"IF('Sublot 1'!G7=\"\",\"\",'Sublot 1'!G7)","v":""},null,null," Plant Location ",null,{"$f":"IF('Sublot 1'!L7=\"\",\"\",'Sublot 1'!L7)","v":""}]
[{"$f":"'Sublot 1'!A8","v":"SM Sample ID"},null,null,null,null,"Mix Type",{"$f":"IF('Sublot 1'!G8=\"\",\"\",'Sublot 1'!G8)","v":""},null,null,"Design No. ",null,{"$f":"IF('Sublot 1'!L8=\"\",\"\",'Sublot 1'!L8)","v":""},null,null,{"$f":"'Sublot 1'!O8","v":"3M+"},"    Million ESALs or PG Grade: Select from drop-down list."]
[]
[null,"EXTRACTIONS AND GRADATIONS",null,null,null,null,null,"IOC",1000,"  TOTAL TONS for this SubLOT"]
[null,"(OHD L-26, AASHTO T-30, T-11)",null,null,null,null,null,{"$f":"IF('Sublot 1'!H11=\"\",\"\",'Sublot 1'!H11)","v":0.18},{"$f":"'Sublot 1'!I11","v":2.6589999999999998},"  Gse from Design",null,"(Gse >= Gsb)"]
[null," Time",null,"Date",null,null,null,"Specimen Wt.",{"$f":"'Sublot 1'!I12","v":2.6120000000000001},"  Gsb from Design",null,null,null,null,"A","    Change for each sheet if A is not used on each.  Rices Precision: Select from drop-down list.  "]
[null," Temperature ",null,"Lot",{"$f":"IF('Sublot 1'!E13=\"\",\"\",'Sublot 1'!E13)","v":1},"SubLot",4,{"$f":"IF('Sublot 1'!H13=\"\",\"\",'Sublot 1'!H13)","v":4700},{"$f":"'Sublot 1'!I13","v":1.01},"  Spec. Grav. AC from Design",null,null,null,null,{"$f":"VLOOKUP(O12,PTable,2,FALSE)","v":1.4E-2},"    Method A - Mechanical or Method B - Manual"]
[null,"SIEVE","JMF","Acc. Wt.","Acc. %"," Total Agg.",null,null,"MAXIMUM SPECIFIC GRAVITY  (AASHTO T209)"]
[null,"SIZE",null,"Retd.","Retd."," % Passing","Dev.",null," Sub-Lot No.",null,null,null,null,null,null,"Limits",null,null,"Tolerance"]
{"$rows_left_out":47}
{"sheet":"Sublot 5","index":4,"n_rows":61,"n_cols":20,"rows_kept":61,"cut":false,"hidden":false,"merged":[[56,8,56,9],[57,8,57,9],[42,8,42,12],[37,8,37,9],[38,8,38,9],[55,8,55,9],[53,8,53,9],[54,8,54,9],[40,8,40,9],[39,8,39,9],[35,8,35,9],[36,8,36,9],[0,1,0,13],[1,0,1,13],[2,0,2,13],[3,0,3,13],[5,1,5,4],[5,6,5,8],[5,9,5,10],[5,11,5,13],[6,1,6,4],[6,6,6,8],[6,9,6,10],[6,11,6,13],[7,1,7,4],[32,8,32,9],[7,6,7,8],[7,9,7,10],[7,11,7,13],[9,1,9,6],[10,1,10,6],[10,9,10,10],[11,4,11,6],[11,9,11,11],[12,9,12,11],[13,8,13,12],[23,8,23,9],[24,8,24,9],[26,8,26,12],[28,8,28,9],[30,1,30,2],[27,8,27,9],[29,8,29,9],[30,8,30,9],[31,1,31,2],[31,8,31,9],[32,1,32,2],[33,1,33,2],[34,1,34,2],[34,8,34,9],[33,8,33,9],[35,1,35,2],[36,1,36,2],[37,1,37,2],[38,1,38,2],[40,1,40,5],[47,1,47,2],[48,1,48,2],[49,1,49,2],[50,1,50,2],[41,1,41,2],[42,1,42,2],[43,1,43,2],[45,1,45,5],[46,1,46,2]]}
[{"$f":"'Sublot 1'!A1","v":"v 1.14"},"OKLAHOMA DEPARTMENT OF TRANSPORTATION"]
["SUPERPAVE"]
["McALESTER RESIDENCY"]
["HOT MIX ASPHALT SAMPLE SHEET"]
[null,null,null,null,null,null,null,null,null,null,null,null,null,null,null,"INFORMATION FROM MIX DESIGN:"]
[" Project No. ",{"$f":"IF('Sublot 1'!B6=\"\",\"\",'Sublot 1'!B6)","v":""},null,null,null,"J.P. No.",{"$f":"IF('Sublot 1'!G6=\"\",\"\",'Sublot 1'!G6)","v":""},null,null,"Contract No. ",null,{"$f":"IF('Sublot 1'!L6=\"\",\"\",'Sublot 1'!L6)","v":""}]
[" Contractor ",{"$f":"IF('Sublot 1'!B7=\"\",\"\",'Sublot 1'!B7)","v":""},null,null,null,"Producer",{"$f":"IF('Sublot 1'!G7=\"\",\"\",'Sublot 1'!G7)","v":""},null,null," Plant Location ",null,{"$f":"IF('Sublot 1'!L7=\"\",\"\",'Sublot 1'!L7)","v":""}]
[{"$f":"'Sublot 1'!A8","v":"SM Sample ID"},null,null,null,null,"Mix Type",{"$f":"IF('Sublot 1'!G8=\"\",\"\",'Sublot 1'!G8)","v":""},null,null,"Design No. ",null,{"$f":"IF('Sublot 1'!L8=\"\",\"\",'Sublot 1'!L8)","v":""},null,null,{"$f":"'Sublot 1'!O8","v":"3M+"},"    Million ESALs or PG Grade: Select from drop-down list."]
[]
[null,"EXTRACTIONS AND GRADATIONS",null,null,null,null,null,"IOC",null,"  TOTAL TONS for this SubLOT"]
[null,"(OHD L-26, AASHTO T-30, T-11)",null,null,null,null,null,{"$f":"IF('Sublot 1'!H11=\"\",\"\",'Sublot 1'!H11)","v":0.18},{"$f":"'Sublot 1'!I11","v":2.6589999999999998},"  Gse from Design",null,"(Gse >= Gsb)"]
[null," Time",null,"Date",null,null,null,"Specimen Wt.",{"$f":"'Sublot 1'!I12","v":2.6120000000000001},"  Gsb from Design",null,null,null,null,"A","    Change for each sheet if A is not used on each.  Rices Precision: Select from drop-down list.  "]
[null," Temperature ",null,"Lot",{"$f":"IF('Sublot 1'!E13=\"\",\"\",'Sublot 1'!E13)","v":1},"SubLot",5,{"$f":"IF('Sublot 1'!H13=\"\",\"\",'Sublot 1'!H13)","v":4700},{"$f":"'Sublot 1'!I13","v":1.01},"  Spec. Grav. AC from Design",null,null,null,null,{"$f":"VLOOKUP(O12,PTable,2,FALSE)","v":1.4E-2},"    Method A - Mechanical or Method B - Manual"]
[null,"SIEVE","JMF","Acc. Wt.","Acc. %"," Total Agg.",null,null,"MAXIMUM SPECIFIC GRAVITY  (AASHTO T209)"]
[null,"SIZE",null,"Retd.","Retd."," % Passing","Dev.",null," Sub-Lot No.",null,null,null,null,null,null,"Limits",null,null,"Tolerance"]
{"$rows_left_out":47}
{"sheet":"Sublot 6","index":5,"n_rows":67,"n_cols":20,"rows_kept":67,"cut":false,"hidden":false,"merged":[[49,1,49,2],[50,1,50,2],[43,1,43,2],[45,1,45,5],[46,1,46,2],[47,1,47,2],[48,1,48,2],[39,8,39,9],[40,1,40,5],[40,8,40,9],[41,1,41,2],[42,1,42,2],[42,8,42,12],[36,1,36,2],[36,8,36,9],[37,1,37,2],[37,8,37,9],[38,1,38,2],[38,8,38,9],[33,1,33,2],[33,8,33,9],[34,1,34,2],[34,8,34,9],[35,1,35,2],[35,8,35,9],[32,1,32,2],[32,8,32,9],[13,8,13,12],[23,8,23,9],[24,8,24,9],[26,8,26,12],[27,8,27,9],[28,8,28,9],[29,8,29,9],[30,1,30,2],[30,8,30,9],[31,1,31,2],[31,8,31,9],[12,9,12,11],[6,1,6,4],[6,6,6,8],[6,9,6,10],[6,11,6,13],[7,1,7,4],[7,6,7,8],[7,9,7,10],[7,11,7,13],[9,1,9,6],[10,1,10,6],[10,9,10,10],[11,4,11,6],[11,9,11,11],[0,1,0,13],[1,0,1,13],[2,0,2,13],[3,0,3,13],[5,1,5,4],[5,6,5,8],[5,9,5,10],[5,11,5,13],[53,8,53,9],[54,8,54,9],[55,8,55,9],[56,8,56,9],[57,8,57,9]]}
[{"$f":"'Sublot 1'!A1","v":"v 1.14"},"OKLAHOMA DEPARTMENT OF TRANSPORTATION"]
["SUPERPAVE"]
["McALESTER RESIDENCY"]
["HOT MIX ASPHALT SAMPLE SHEET"]
[null,null,null,null,null,null,null,null,null,null,null,null,null,null,null,"INFORMATION FROM MIX DESIGN:"]
[" Project No. ",{"$f":"IF('Sublot 1'!B6=\"\",\"\",'Sublot 1'!B6)","v":""},null,null,null,"J.P. No.",{"$f":"IF('Sublot 1'!G6=\"\",\"\",'Sublot 1'!G6)","v":""},null,null,"Contract No. ",null,{"$f":"IF('Sublot 1'!L6=\"\",\"\",'Sublot 1'!L6)","v":""}]
[" Contractor ",{"$f":"IF('Sublot 1'!B7=\"\",\"\",'Sublot 1'!B7)","v":""},null,null,null,"Producer",{"$f":"IF('Sublot 1'!G7=\"\",\"\",'Sublot 1'!G7)","v":""},null,null," Plant Location ",null,{"$f":"IF('Sublot 1'!L7=\"\",\"\",'Sublot 1'!L7)","v":""}]
[{"$f":"'Sublot 1'!A8","v":"SM Sample ID"},null,null,null,null,"Mix Type",{"$f":"IF('Sublot 1'!G8=\"\",\"\",'Sublot 1'!G8)","v":""},null,null,"Design No. ",null,{"$f":"IF('Sublot 1'!L8=\"\",\"\",'Sublot 1'!L8)","v":""},null,null,{"$f":"'Sublot 1'!O8","v":"3M+"},"    Million ESALs or PG Grade: Select from drop-down list."]
[]
[null,"EXTRACTIONS AND GRADATIONS",null,null,null,null,null,"IOC",null,"  TOTAL TONS for this SubLOT"]
[null,"(OHD L-26, AASHTO T-30, T-11)",null,null,null,null,null,{"$f":"IF('Sublot 1'!H11=\"\",\"\",'Sublot 1'!H11)","v":0.18},{"$f":"'Sublot 1'!I11","v":2.6589999999999998},"  Gse from Design",null,"(Gse >= Gsb)"]
[null," Time",null,"Date",null,null,null,"Specimen Wt.",{"$f":"'Sublot 1'!I12","v":2.6120000000000001},"  Gsb from Design",null,null,null,null,"A","    Change for each sheet if A is not used on each.  Rices Precision: Select from drop-down list.  "]
[null," Temperature ",null,"Lot",{"$f":"IF('Sublot 1'!E13=\"\",\"\",'Sublot 1'!E13)","v":1},"SubLot",6,{"$f":"IF('Sublot 1'!H13=\"\",\"\",'Sublot 1'!H13)","v":4700},{"$f":"'Sublot 1'!I13","v":1.01},"  Spec. Grav. AC from Design",null,null,null,null,{"$f":"VLOOKUP(O12,PTable,2,FALSE)","v":1.4E-2},"    Method A - Mechanical or Method B - Manual"]
[null,"SIEVE","JMF","Acc. Wt.","Acc. %"," Total Agg.",null,null,"MAXIMUM SPECIFIC GRAVITY  (AASHTO T209)"]
[null,"SIZE",null,"Retd.","Retd."," % Passing","Dev.",null," Sub-Lot No.",null,null,null,null,null,null,"Limits",null,null,"Tolerance"]
{"$rows_left_out":53}
{"sheet":"Pay Factors","index":6,"n_rows":230,"n_cols":129,"rows_kept":230,"cut":false,"hidden":false,"merged":[[35,2,48,10],[1,1,1,10],[2,2,2,4],[4,2,4,5],[8,1,8,3],[8,5,8,6],[11,1,11,2],[4,8,4,10],[2,6,2,8],[11,9,12,9],[11,10,12,10],[32,6,32,7]]}
[null,{"$f":"'Sublot 1'!A1","v":"v 1.14"},null,"OKLAHOMA DEPARTMENT OF TRANSPORTATION"]
[null,"ASPHALT CONCRETE PAVING"]
[null,"PROJECT  NO:",{"$f":"IF('Sublot 1'!B6=\"\",\"\",'Sublot 1'!B6)","v":""},null,null,"  COUNTY:",null,null,null,"  DATE:  "]
[]
[null,"CONTRACTOR:",{"$f":"IF('Sublot 1'!B7=\"\",\"\",'Sublot 1'!B7)","v":""},null,null,null,"  ASPHALT  DESIGN  NO:",null,{"$f":"IF('Sublot 1'!L8=\"\",\"\",'Sublot 1'!L8)","v":""}]
[]
[]
[]
[null,"ID  ",null,null,"LOT NO.",{"$f":"'Sublot 1'!E13","v":1},null,null,"Total Tons",{"$f":"SUM('Sublot 1'!I10,'Sublot 2'!I10,'Sublot 3'!I10,'Sublot 4'!I10,'Sublot 5'!I10,'Sublot 6'!I10)","v":4000}]
[]
[]
[null,"DESIGN",null,{"$f":"\"SUBLOT \" &'Sublot 1'!G13","v":"SUBLOT 1"},{"$f":"\"SUBLOT \" &'Sublot 2'!G13","v":"SUBLOT 2"},{"$f":"\"SUBLOT \" &'Sublot 3'!G13","v":"SUBLOT 3"},{"$f":"\"SUBLOT \" &'Sublot 4'!G13","v":"SUBLOT 4"},{"$f":"\"SUBLOT \" &'Sublot 5'!G13","v":"SUBLOT 5"},{"$f":"\"SUBLOT \" &'Sublot 6'!G13","v":"SUBLOT 6"},"PFs","Reason to\nWaive PF"]
[null,"SIEVE SIZE","JMF","Test Result","Test Result","Test Result","Test Result","Test Result","Test Result"]
[null,"1\"",{"$f":"IF('Sublot 1'!$C$17=\"\",\"\",'Sublot 1'!$C$17)","v":100},{"$f":"IF('Sublot 1'!$F$17=\"\",\"\",'Sublot 1'!$F$17)","v":100},{"$f":"IF('Sublot 2'!$F$17=\"\",\"\",'Sublot 2'!$F$17)","v":100},{"$f":"IF('Sublot 3'!$F$17=\"\",\"\",'Sublot 3'!$F$17)","v":100},{"$f":"IF('Sublot 4'!$F$17=\"\",\"\",'Sublot 4'!$F$17)","v":100},{"$f":"IF('Sublot 5'!$F$17=\"\",\"\",'Sublot 5'!$F$17)","v":""},{"$f":"IF('Sublot 6'!$F$17=\"\",\"\",'Sublot 6'!$F$17)","v":""}]
[null,"3/4\"",{"$f":"IF('Sublot 1'!$C$18=\"\",\"\",'Sublot 1'!$C$18)","v":100},{"$f":"IF('Sublot 1'!$F$18=\"\",\"\",'Sublot 1'!$F$18)","v":100},{"$f":"IF('Sublot 2'!$F$18=\"\",\"\",'Sublot 2'!$F$18)","v":100},{"$f":"IF('Sublot 3'!$F$18=\"\",\"\",'Sublot 3'!$F$18)","v":100},{"$f":"IF('Sublot 4'!$F$18=\"\",\"\",'Sublot 4'!$F$18)","v":100},{"$f":"IF('Sublot 5'!$F$18=\"\",\"\",'Sublot 5'!$F$18)","v":""},{"$f":"IF('Sublot 6'!$F$18=\"\",\"\",'Sublot 6'!$F$18)","v":""}]
{"$rows_left_out":216}
{"sheet":"Instructions","index":7,"n_rows":57,"n_cols":3,"rows_kept":57,"cut":false,"hidden":false,"merged":[]}
[" REQUIRED DATA FOR CALCULATIONS:  (Enter on Sublot 1 Tab only)",null,"Information:"]
["Sheet Sublot 1:"]
["Enter project information in the header cells B6 to L8.",null,"All data in blue text with yellow background is test data entry."]
[]
["Enter JMF gradations in cells C16 to C27."]
[]
["Enter JMF AC content in cell C29."]
[]
["Enter Tons for this Test Report in cell I9"]
[]
["Enter Data from Design in cells I11 to I13"]
[]
["Select the ESAL level or PG Grade in cell O8 using the dropdown selection list."]
[]
["Goto cells O39 and Q39 and enter %Density of GMM reqd. as listed on JMF."]
{"$rows_left_out":43}
{"sheet":"Tables","index":8,"n_rows":57,"n_cols":9,"rows_kept":57,"cut":false,"hidden":false,"merged":[[52,2,52,3],[53,2,53,3],[54,2,54,3],[55,2,55,3],[45,2,45,3],[46,2,46,3],[47,2,47,3],[48,2,48,3],[50,2,50,4],[51,2,51,3],[44,2,44,3],[31,2,31,4],[32,2,32,3],[33,2,33,4],[34,2,34,3],[35,2,35,3],[36,2,36,3],[38,2,38,4],[39,2,39,3],[40,2,40,3],[42,2,42,4],[43,2,43,3],[30,2,30,3],[7,8,7,9],[8,8,8,9],[9,8,9,9],[10,8,10,9],[11,8,11,9],[12,8,12,9],[11,6,11,7],[12,6,12,7],[24,2,24,4],[26,2,26,3],[27,2,27,3],[28,2,28,3],[29,2,29,3],[13,6,13,7],[13,8,13,9],[1,8,1,9],[2,8,2,9],[3,8,3,9],[4,8,4,9],[5,8,5,9],[6,8,6,9],[7,6,7,7],[8,6,8,7],[9,6,9,7],[10,6,10,7],[6,6,6,7],[1,6,1,7],[2,6,2,7],[3,6,3,7],[4,6,4,7],[5,6,5,7]]}
[null,null,"Special Provision 708-3 and 2009 Standard Specifications:"]
[null,null,"MESALs","Nini","Ndes","Nmax","MinNini",null,"MaxNini"]
[null,null,"0.3M-",6,50,75,85.5,null,91.5]
[null,null,"0.3M+",7,75,115,85.5,null,90.5]
[null,null,"3M+",8,100,160,85.5,null,89]
[null,null,"10M+",8,100,160,85.5,null,89]
[null,null,"30M+",9,125,205,85.5,null,89]
[null,null,"PG64",6,50,96,85.5,null,91.5]
[null,null,"PG70",7,65,96,85.5,null,90.5]
[null,null,"PG76",8,80,96,85.5,null,89]
[null,null,"SMA-PG76",0,50,96,0,null,0]
[null,null,"PFC-PG76",0,50,96,0,null,0]
[null,null,"RBL-PG64",0,50,96,0,null,0]
[null,null,"RIL-PG76E",0,50,97,0,null,0]
[]
{"$rows_left_out":43}
{"sheet":"Disclaimer","index":9,"n_rows":18,"n_cols":1,"rows_kept":18,"cut":false,"hidden":false,"merged":[]}
["By using this file, you are agreeing to this License Agreement:"]
[]
["The Oklahoma Department of Transportation (ODOT) does not provide technical support with respect to these files. Read the following disclaimer for terms of use pior to using this file."]
[]
[]
["ODOT makes no warranty of any kind, express or implied, with respect to any file. ODOT makes no warranty that any file is marketable or fit for any particular purpose. A description of a file shall not be deemed to create an express warranty that the file conforms to that description. You agree to accept the files in the format provided."]
[]
[]
["You assume all risk and liability for any losses, damages, claims, or expenses resulting from the use or possession of any file."]
[]
[]
["You agree to indemnify, defend, and hold harmless ODOT and its officers, agents, and employees from and against any and all claims, suits, losses, damages, or costs, including reasonable attorney's fees, arising from or by reason of your use or possession of any file. This indemnification shall survive your acceptance of any file."]
[]
[]
["Revisions or additions may occur at any time. You agree to indemnify, defend, and hold harmless ODOT and its officers, agents, and employees from and against any and all claims, suits, losses, damages, or costs, including reasonable attorney's fees, arising from the use of outdated files. This indemnification shall survive your acceptance of any file."]
{"$rows_left_out":3}