{"text_format":"1","workbook":"xlsx","n_sheets":9,"sheets":["Sublot 1","Sublot 2","Sublot 3","Sublot 4","Sublot 5","Pay Factors","Tables","Instructions","Disclaimer"],"not_rendered":{"charts":0,"images":6,"macros":1,"external_links":3,"defined_names":31,"comments":5,"pivot_tables":0},"unopened":[],"bounds":{"document_bytes":16777216,"sheet_cells":100000,"rows_first":2000,"rows_last":500,"rows_between":2000,"halvings":0,"cell_chars":16384,"cell_head_chars":4096},"cells_cut":0,"cells_raw":0,"read":"whole","date_system":"1900"}

{"sheet":"Sublot 1","index":0,"n_rows":67,"n_cols":20,"rows_kept":67,"cut":false,"hidden":false,"merged":[[10,1,10,6],[11,4,11,6],[6,6,6,8],[5,9,5,10],[7,6,7,8],[23,8,23,9],[13,8,13,12],[10,9,10,10],[11,9,11,11],[12,9,12,11],[55,8,55,9],[56,8,56,9],[57,8,57,9],[58,8,58,9],[48,8,48,9],[49,8,49,9],[50,8,50,9],[51,8,51,9],[32,8,32,9],[33,8,33,9],[54,1,54,2],[55,1,55,2],[46,1,46,2],[47,1,47,2],[48,1,48,2],[49,1,49,2],[38,8,38,9],[39,8,39,9],[40,8,40,9],[34,8,34,9],[35,8,35,9],[36,8,36,9],[37,8,37,9],[52,8,52,9],[27,8,27,9],[28,8,28,9],[29,8,29,9],[30,8,30,9],[31,8,31,9],[40,1,40,5],[42,1,42,2],[43,1,43,2],[41,1,41,2],[56,1,56,2],[30,1,30,2],[31,1,31,2],[32,1,32,2],[33,1,33,2],[38,1,38,2],[34,1,34,2],[35,1,35,2],[36,1,36,2],[37,1,37,2],[26,8,26,12],[6,1,6,4],[9,1,9,6],[0,1,0,13],[6,9,6,10],[7,9,7,10],[2,0,2,13],[7,11,7,13],[5,1,5,4],[7,1,7,4],[5,6,5,8],[5,11,5,13],[6,11,6,13],[1,0,1,13],[3,0,3,13],[24,8,24,9],[59,1,59,2],[42,8,43,8],[42,9,43,9],[42,10,43,10],[42,11,43,11],[47,8,47,12],[52,1,52,5],[50,1,50,2],[53,1,53,2],[45,1,45,5],[57,1,57,2],[58,1,58,2],[42,12,43,12],[59,8,59,9],[53,8,53,9],[54,8,54,9],[60,8,60,9],[61,8,61,9],[62,8,62,9],[63,8,63,9],[64,8,64,9]]}
["v 1.17","OKLAHOMA DEPARTMENT OF TRANSPORTATION"]
["SUPERPAVE"]
["McALESTER RESIDENCY"]
["HOT MIX ASPHALT SAMPLE SHEET"]
[null,null,null,null,null,null,null,null,null,null,null,null,null,null,null,"INFORMATION FROM MIX DESIGN:"]
[" Project No.",null,null,null,null,"J.P. No.",null,null,null,"Contract No. "]
[" Contractor",null,null,null,null,"Producer",null,null,null," Plant Location "]
["SM Sample ID",null,null,null,null,"Mix Type",null,null,null,"Design No. ",null,null,null,null,"PG64","    Million ESALs or PG Grade: Select from drop-down list."]
[]
[null,"EXTRACTIONS AND GRADATIONS",null,null,null,null,null,"IOC",null,"  TOTAL TONS for this SubLOT"]
{"$rows_left_out":58}
{"sheet":"Sublot 2","index":1,"n_rows":67,"n_cols":21,"rows_kept":67,"cut":false,"hidden":false,"merged":[[60,8,60,9],[61,8,61,9],[62,8,62,9],[63,8,63,9],[64,8,64,9],[59,1,59,2],[42,8,43,8],[42,9,43,9],[42,10,43,10],[42,11,43,11],[47,8,47,12],[59,8,59,9],[50,8,50,9],[51,8,51,9],[52,8,52,9],[53,8,53,9],[54,8,54,9],[55,8,55,9],[49,8,49,9],[42,12,43,12],[48,1,48,2],[37,8,37,9],[38,8,38,9],[39,8,39,9],[40,8,40,9],[48,8,48,9],[31,8,31,9],[32,8,32,9],[33,8,33,9],[34,8,34,9],[35,8,35,9],[36,8,36,9],[1,0,1,13],[2,0,2,13],[3,0,3,13],[5,1,5,4],[5,6,5,8],[5,9,5,10],[5,11,5,13],[6,1,6,4],[6,6,6,8],[6,9,6,10],[6,11,6,13],[7,1,7,4],[7,6,7,8],[7,9,7,10],[7,11,7,13],[9,1,9,6],[10,1,10,6],[10,9,10,10],[11,4,11,6],[11,9,11,11],[12,9,12,11],[13,8,13,12],[23,8,23,9],[24,8,24,9],[26,8,26,12],[28,8,28,9],[30,1,30,2],[27,8,27,9],[29,8,29,9],[30,8,30,9],[31,1,31,2],[32,1,32,2],[33,1,33,2],[34,1,34,2],[35,1,35,2],[49,1,49,2],[50,1,50,2],[36,1,36,2],[37,1,37,2],[38,1,38,2],[40,1,40,5],[41,1,41,2],[0,1,0,13],[57,8,57,9],[58,8,58,9],[56,8,56,9],[52,1,52,5],[53,1,53,2],[57,1,57,2],[58,1,58,2],[54,1,54,2],[55,1,55,2],[42,1,42,2],[43,1,43,2],[56,1,56,2],[45,1,45,5],[46,1,46,2],[47,1,47,2]]}
[{"$f":"'Sublot 1'!A1","v":"v 1.17"},"OKLAHOMA DEPARTMENT OF TRANSPORTATION"]
["SUPERPAVE"]
[{"$f":"'Sublot 1'!A3:N3","v":"McALESTER RESIDENCY"}]
["HOT MIX ASPHALT SAMPLE SHEET"]
[null,null,null,null,null,null,null,null,null,null,null,null,null,null,null,"INFORMATION FROM MIX DESIGN:"]
[" Project No. ",{"$f":"IF('Sublot 1'!B6=\"\",\"\",'Sublot 1'!B6)","v":""},null,null,null,"J.P. No.",{"$f":"IF('Sublot 1'!G6=\"\",\"\",'Sublot 1'!G6)","v":""},null,null,"Contract No. ",null,{"$f":"IF('Sublot 1'!L6=\"\",\"\",'Sublot 1'!L6)","v":""}]
[" Contractor ",{"$f":"IF('Sublot 1'!B7=\"\",\"\",'Sublot 1'!B7)","v":""},null,null,null,"Producer",{"$f":"IF('Sublot 1'!G7=\"\",\"\",'Sublot 1'!G7)","v":""},null,null," Plant Location ",null,{"$f":"IF('Sublot 1'!L7=\"\",\"\",'Sublot 1'!L7)","v":""}]
[{"$f":"'Sublot 1'!A8","v":"SM Sample ID"},null,null,null,null,"Mix Type",{"$f":"IF('Sublot 1'!G8=\"\",\"\",'Sublot 1'!G8)","v":""},null,null,"Design No. ",null,{"$f":"IF('Sublot 1'!L8=\"\",\"\",'Sublot 1'!L8)","v":""},null,null,{"$f":"'Sublot 1'!O8","v":"PG64"},"    Million ESALs or PG Grade: Select from drop-down list."]
[]
[null,"EXTRACTIONS AND GRADATIONS",null,null,null,null,null,"IOC",null,"  TOTAL TONS for this SubLOT"]
{"$rows_left_out":58}
{"sheet":"Sublot 3","index":2,"n_rows":67,"n_cols":21,"rows_kept":67,"cut":false,"hidden":false,"merged":[[60,8,60,9],[61,8,61,9],[62,8,62,9],[63,8,63,9],[64,8,64,9],[59,1,59,2],[42,8,43,8],[42,9,43,9],[42,10,43,10],[42,11,43,11],[47,8,47,12],[42,12,43,12],[59,8,59,9],[58,8,58,9],[57,8,57,9],[56,8,56,9],[55,8,55,9],[53,8,53,9],[54,8,54,9],[47,1,47,2],[48,1,48,2],[29,8,29,9],[30,8,30,9],[31,8,31,9],[32,8,32,9],[52,8,52,9],[37,8,37,9],[38,8,38,9],[39,8,39,9],[40,8,40,9],[48,8,48,9],[49,8,49,9],[50,8,50,9],[51,8,51,9],[49,1,49,2],[57,1,57,2],[33,8,33,9],[34,8,34,9],[35,8,35,9],[36,8,36,9],[41,1,41,2],[42,1,42,2],[43,1,43,2],[45,1,45,5],[46,1,46,2],[58,1,58,2],[50,1,50,2],[52,1,52,5],[53,1,53,2],[54,1,54,2],[55,1,55,2],[56,1,56,2],[13,8,13,12],[23,8,23,9],[24,8,24,9],[40,1,40,5],[26,8,26,12],[28,8,28,9],[30,1,30,2],[31,1,31,2],[32,1,32,2],[33,1,33,2],[34,1,34,2],[35,1,35,2],[36,1,36,2],[37,1,37,2],[38,1,38,2],[27,8,27,9],[12,9,12,11],[6,1,6,4],[6,6,6,8],[6,9,6,10],[6,11,6,13],[7,1,7,4],[7,6,7,8],[7,9,7,10],[7,11,7,13],[9,1,9,6],[10,1,10,6],[10,9,10,10],[11,4,11,6],[11,9,11,11],[0,1,0,13],[1,0,1,13],[2,0,2,13],[3,0,3,13],[5,1,5,4],[5,6,5,8],[5,9,5,10],[5,11,5,13]]}
[{"$f":"'Sublot 1'!A1","v":"v 1.17"},"OKLAHOMA DEPARTMENT OF TRANSPORTATION"]
["SUPERPAVE"]
[{"$f":"'Sublot 1'!A3:N3","v":"McALESTER RESIDENCY"}]
["HOT MIX ASPHALT SAMPLE SHEET"]
[null,null,null,null,null,null,null,null,null,null,null,null,null,null,null,"INFORMATION FROM MIX DESIGN:"]
[" Project No. ",{"$f":"IF('Sublot 1'!B6=\"\",\"\",'Sublot 1'!B6)","v":""},null,null,null,"J.P. No.",{"$f":"IF('Sublot 1'!G6=\"\",\"\",'Sublot 1'!G6)","v":""},null,null,"Contract No. ",null,{"$f":"IF('Sublot 1'!L6=\"\",\"\",'Sublot 1'!L6)","v":""}]
[" Contractor ",{"$f":"IF('Sublot 1'!B7=\"\",\"\",'Sublot 1'!B7)","v":""},null,null,null,"Producer",{"$f":"IF('Sublot 1'!G7=\"\",\"\",'Sublot 1'!G7)","v":""},null,null," Plant Location ",null,{"$f":"IF('Sublot 1'!L7=\"\",\"\",'Sublot 1'!L7)","v":""}]
[{"$f":"'Sublot 1'!A8","v":"SM Sample ID"},null,null,null,null,"Mix Type",{"$f":"IF('Sublot 1'!G8=\"\",\"\",'Sublot 1'!G8)","v":""},null,null,"Design No. ",null,{"$f":"IF('Sublot 1'!L8=\"\",\"\",'Sublot 1'!L8)","v":""},null,null,{"$f":"'Sublot 1'!O8","v":"PG64"},"    Million ESALs or PG Grade: Select from drop-down list."]
[]
[null,"EXTRACTIONS AND GRADATIONS",null,null,null,null,null,"IOC",null,"  TOTAL TONS for this SubLOT"]
{"$rows_left_out":58}
{"sheet":"Sublot 4","index":3,"n_rows":67,"n_cols":21,"rows_kept":67,"cut":false,"hidden":false,"merged":[[60,8,60,9],[61,8,61,9],[62,8,62,9],[63,8,63,9],[64,8,64,9],[59,1,59,2],[42,8,43,8],[42,9,43,9],[42,10,43,10],[42,11,43,11],[47,8,47,12],[49,8,49,9],[50,8,50,9],[57,8,57,9],[58,8,58,9],[59,8,59,9],[51,8,51,9],[52,8,52,9],[53,8,53,9],[54,8,54,9],[55,8,55,9],[56,8,56,9],[48,8,48,9],[39,8,39,9],[34,8,34,9],[35,8,35,9],[36,8,36,9],[40,8,40,9],[42,12,43,12],[48,1,48,2],[49,1,49,2],[41,1,41,2],[42,1,42,2],[43,1,43,2],[47,1,47,2],[31,8,31,9],[32,8,32,9],[33,8,33,9],[37,8,37,9],[38,8,38,9],[57,1,57,2],[58,1,58,2],[50,1,50,2],[52,1,52,5],[53,1,53,2],[54,1,54,2],[55,1,55,2],[56,1,56,2],[31,1,31,2],[32,1,32,2],[33,1,33,2],[45,1,45,5],[46,1,46,2],[34,1,34,2],[35,1,35,2],[36,1,36,2],[37,1,37,2],[38,1,38,2],[40,1,40,5],[30,1,30,2],[27,8,27,9],[29,8,29,9],[30,8,30,9],[9,1,9,6],[10,1,10,6],[10,9,10,10],[11,4,11,6],[11,9,11,11],[12,9,12,11],[13,8,13,12],[23,8,23,9],[24,8,24,9],[26,8,26,12],[28,8,28,9],[6,1,6,4],[6,6,6,8],[6,9,6,10],[6,11,6,13],[7,1,7,4],[7,6,7,8],[7,9,7,10],[7,11,7,13],[0,1,0,13],[1,0,1,13],[2,0,2,13],[3,0,3,13],[5,1,5,4],[5,6,5,8],[5,9,5,10],[5,11,5,13]]}
[{"$f":"'Sublot 1'!A1","v":"v 1.17"},"OKLAHOMA DEPARTMENT OF TRANSPORTATION"]
["SUPERPAVE"]
["McALESTER RESIDENCY"]
["HOT MIX ASPHALT SAMPLE SHEET"]
[null,null,null,null,null,null,null,null,null,null,null,null,null,null,null,"INFORMATION FROM MIX DESIGN:"]
[" Project No. ",{"$f":"IF('Sublot 1'!B6=\"\",\"\",'Sublot 1'!B6)","v":""},null,null,null,"J.P. No.",{"$f":"IF('Sublot 1'!G6=\"\",\"\",'Sublot 1'!G6)","v":""},null,null,"Contract No. ",null,{"$f":"IF('Sublot 1'!L6=\"\",\"\",'Sublot 1'!L6)","v":""}]
[" Contractor ",{"$f":"IF('Sublot 1'!B7=\"\",\"\",'Sublot 1'!B7)","v":""},null,null,null,"Producer",{"$f":"IF('Sublot 1'!G7=\"\",\"\",'Sublot 1'!G7)","v":""},null,null," Plant Location ",null,{"$f":"IF('Sublot 1'!L7=\"\",\"\",'Sublot 1'!L7)","v":""}]
[{"$f":"'Sublot 1'!A8","v":"SM Sample ID"},null,null,null,null,"Mix Type",{"$f":"IF('Sublot 1'!G8=\"\",\"\",'Sublot 1'!G8)","v":""},null,null,"Design No. ",null,{"$f":"IF('Sublot 1'!L8=\"\",\"\",'Sublot 1'!L8)","v":""},null,null,{"$f":"'Sublot 1'!O8","v":"PG64"},"    Million ESALs or PG Grade: Select from drop-down list."]
[]
[null,"EXTRACTIONS AND GRADATIONS",null,null,null,null,null,"IOC",null,"  TOTAL TONS for this SubLOT"]
{"$rows_left_out":58}
{"sheet":"Sublot 5","index":4,"n_rows":67,"n_cols":32,"rows_kept":67,"cut":false,"hidden":false,"merged":[[61,8,61,9],[62,8,62,9],[63,8,63,9],[64,8,64,9],[42,10,43,10],[42,9,43,9],[56,8,56,9],[57,8,57,9],[58,8,58,9],[59,8,59,9],[42,11,43,11],[42,12,43,12],[47,8,47,12],[60,8,60,9],[37,8,37,9],[38,8,38,9],[55,8,55,9],[49,8,49,9],[50,8,50,9],[51,8,51,9],[52,8,52,9],[53,8,53,9],[54,8,54,9],[40,8,40,9],[39,8,39,9],[42,8,43,8],[35,8,35,9],[36,8,36,9],[0,1,0,13],[1,0,1,13],[2,0,2,13],[3,0,3,13],[5,1,5,4],[5,6,5,8],[5,9,5,10],[5,11,5,13],[6,1,6,4],[6,6,6,8],[6,9,6,10],[6,11,6,13],[7,1,7,4],[32,8,32,9],[7,6,7,8],[7,9,7,10],[7,11,7,13],[9,1,9,6],[10,1,10,6],[10,9,10,10],[11,4,11,6],[11,9,11,11],[12,9,12,11],[13,8,13,12],[23,8,23,9],[24,8,24,9],[26,8,26,12],[28,8,28,9],[30,1,30,2],[27,8,27,9],[29,8,29,9],[30,8,30,9],[31,1,31,2],[31,8,31,9],[32,1,32,2],[33,1,33,2],[34,1,34,2],[34,8,34,9],[33,8,33,9],[35,1,35,2],[36,1,36,2],[37,1,37,2],[38,1,38,2],[40,1,40,5],[41,1,41,2],[42,1,42,2],[43,1,43,2],[45,1,45,5],[46,1,46,2],[47,1,47,2],[48,1,48,2],[49,1,49,2],[48,8,48,9],[50,1,50,2],[57,1,57,2],[58,1,58,2],[59,1,59,2],[52,1,52,5],[53,1,53,2],[54,1,54,2],[55,1,55,2],[56,1,56,2]]}
[{"$f":"'Sublot 1'!A1","v":"v 1.17"},"OKLAHOMA DEPARTMENT OF TRANSPORTATION"]
["SUPERPAVE"]
["McALESTER RESIDENCY"]
["HOT MIX ASPHALT SAMPLE SHEET"]
[null,null,null,null,null,null,null,null,null,null,null,null,null,null,null,"INFORMATION FROM MIX DESIGN:"]
[" Project No. ",{"$f":"IF('Sublot 1'!B6=\"\",\"\",'Sublot 1'!B6)","v":""},null,null,null,"J.P. No.",{"$f":"IF('Sublot 1'!G6=\"\",\"\",'Sublot 1'!G6)","v":""},null,null,"Contract No. ",null,{"$f":"IF('Sublot 1'!L6=\"\",\"\",'Sublot 1'!L6)","v":""}]
[" Contractor ",{"$f":"IF('Sublot 1'!B7=\"\",\"\",'Sublot 1'!B7)","v":""},null,null,null,"Producer",{"$f":"IF('Sublot 1'!G7=\"\",\"\",'Sublot 1'!G7)","v":""},null,null," Plant Location ",null,{"$f":"IF('Sublot 1'!L7=\"\",\"\",'Sublot 1'!L7)","v":""}]
[{"$f":"'Sublot 1'!A8","v":"SM Sample ID"},null,null,null,null,"Mix Type",{"$f":"IF('Sublot 1'!G8=\"\",\"\",'Sublot 1'!G8)","v":""},null,null,"Design No. ",null,{"$f":"IF('Sublot 1'!L8=\"\",\"\",'Sublot 1'!L8)","v":""},null,null,{"$f":"'Sublot 1'!O8","v":"PG64"},"    Million ESALs or PG Grade: Select from drop-down list."]
[]
[null,"EXTRACTIONS AND GRADATIONS",null,null,null,null,null,"IOC",null,"  TOTAL TONS for this SubLOT"]
{"$rows_left_out":58}
{"sheet":"Pay Factors","index":5,"n_rows":243,"n_cols":126,"rows_kept":243,"cut":false,"hidden":false,"merged":[[12,19,12,20],[11,19,11,20],[0,9,0,22],[2,1,2,3],[4,1,4,4],[2,10,2,14],[1,8,1,22],[2,8,2,9],[3,8,3,9],[4,8,4,9],[11,15,11,16],[11,17,11,18],[12,17,12,18],[48,11,48,12],[48,13,48,14],[4,10,4,14],[2,16,2,18],[43,9,43,12],[12,11,12,12],[12,13,12,14],[11,11,11,12],[11,13,11,14],[12,9,12,10],[10,9,10,10],[6,8,6,22],[4,15,4,16],[4,17,4,21],[12,15,12,16],[2,20,2,21],[45,15,45,16],[45,17,45,18],[44,15,44,16],[44,17,44,18],[22,1,22,5],[21,2,21,5],[19,2,19,4],[26,2,26,5],[46,13,46,14],[44,11,44,12],[44,13,44,14],[45,11,45,12],[45,13,45,14],[46,11,46,12],[32,8,32,10],[35,8,35,10],[38,8,38,10],[33,9,33,11],[36,9,36,11],[39,9,39,11],[46,17,46,18],[48,15,48,16],[69,64,69,65],[52,52,52,54],[60,64,60,65],[48,17,48,18],[64,17,64,18],[47,15,47,16],[46,15,46,16],[29,21,29,22],[32,21,32,22],[35,21,35,22],[38,21,38,22],[70,64,70,65],[61,64,61,65]]}
[null,null,null,null,null,null,null,null,{"$f":"'Sublot 1'!A1","v":"v 1.17"},"OKLAHOMA DEPARTMENT OF TRANSPORTATION"]
[null,null,null,null,null,null,null,null,{"$f":"'Sublot 1'!G8 & \" - ASPHALT CONCRETE PAVING\"","v":" - ASPHALT CONCRETE PAVING"}]
[null,null,null,null,null,null,null,null,"PROJECT  NO: ",null,{"$f":"IF('Sublot 1'!B6=\"\",\"\",'Sublot 1'!B6)","v":""},null,null,null,null,"COUNTY:",null,null,null,"DATE:"]
[]
[null,null,null,null,null,null,null,null,"CONTRACTOR: ",null,{"$f":"IF('Sublot 1'!B7=\"\",\"\",'Sublot 1'!B7)","v":""},null,null,null,null,"ASPHALT  DESIGN  NO:",null,{"$f":"IF('Sublot 1'!L8=\"\",\"\",'Sublot 1'!L8)","v":""}]
[]
[null,null,null,null,null,null,null,null,"250 TON - 1000 TON  =  ONE SUBLOT          4,000 TON  =  ONE LOT"]
[]
[null,null,null,null,null,null,null,null,null,null,null,null,null,null,"LOT NO. ",{"$f":"'Sublot 1'!E13","v":1}]
[]
{"$rows_left_out":234}
{"sheet":"Tables","index":6,"n_rows":81,"n_cols":45,"rows_kept":81,"cut":false,"hidden":false,"merged":[[76,2,76,3],[77,2,77,3],[78,2,78,3],[79,2,79,3],[69,2,69,3],[70,2,70,3],[71,2,71,3],[72,2,72,3],[74,2,74,4],[75,2,75,3],[68,2,68,3],[55,2,55,4],[56,2,56,3],[57,2,57,4],[58,2,58,3],[59,2,59,3],[60,2,60,3],[62,2,62,4],[63,2,63,3],[64,2,64,3],[66,2,66,4],[67,2,67,3],[54,2,54,3],[31,8,31,9],[32,8,32,9],[33,8,33,9],[34,8,34,9],[35,8,35,9],[36,8,36,9],[35,6,35,7],[36,6,36,7],[48,2,48,4],[50,2,50,3],[51,2,51,3],[52,2,52,3],[53,2,53,3],[37,6,37,7],[37,8,37,9],[25,8,25,9],[26,8,26,9],[27,8,27,9],[28,8,28,9],[29,8,29,9],[30,8,30,9],[31,6,31,7],[32,6,32,7],[33,6,33,7],[34,6,34,7],[30,6,30,7],[25,6,25,7],[26,6,26,7],[27,6,27,7],[28,6,28,7],[29,6,29,7]]}
[]
[null,null,"Average of Deviations from Target (without regard to signs)",null,null,null,null,null,null,null,null,null,null,null,"Average of Deviations from Target (without regard to signs)",null,null,null,null,null,null,null,null,null,null,"Average of Deviations from Target (without regard to signs)",null,null,null,null,null,null,null,null,null,"Average of Deviations from Target (considering signs)"]
[null,null,"CHARACTERISTICS","            4",null,"PAY",null,null,null,null,null,null,null,"CHARACTERISTICS","            4",null,"PAY",null,null,null,null,null,null,null,"CHARACTERISTICS","            4",null,"PAY",null,null,null,null,null,null,null,"CHARACTERISTICS","            4",null,"PAY"]
[null,null,null,"       TESTS",null,"FACTOR",null,null,null,null,null,null,null,null,"       TESTS",null,"FACTOR",null,null,null,null,null,null,null,null,"       TESTS",null,"FACTOR",null,null,null,null,null,null,null,null,"       TESTS",null,"FACTOR"]
[null,null," ASPHALT CEMENT",0,0.35,null,1,null,null,null,null,null,null,"      GRADATION",0,4,null,1,null,null,null,null,null,null,"        AIR VOIDS",0,1.25,null,null,null,1,null,null,null,null,"ROADWAY DENSITY",null,2,null,null,null,0]
[null,null," CONTENT",0.36,0.45,1.35,"-","x","x",null,null,null,null,"% Passing No. 4 & ",4.01,7,1.1599999999999999,"-",0.04,"x",null,null,null,null,"(Lab Molded",1.26,1.5,-2.4,"x2   +",null,5.8,"x    -",2.5,null,null,"(Core or Nuclear)",2,-1,null,null,null,1]
[null,"(Extraction, Nuclear or Ignition Oven)  ",null,0.46,0.5,1.8,"-",2,"x",null,null,null,null,"Larger Sieve",7.01,9,1.3,"-",0.06,"x",null,null,null,null,"specimens)",null,1.5,null,null,null,0,null,null,null,"Target ","94% of Maximum",-1.01,-4,-5.6000000000000001E-2,"x2     -",null,0.112,"x  +",0.94399999999999995]
[null,"Target","JMF - Percent (%)",null,0.5,null,0,null,null,"  Unacceptable",null,null,"Target ","JMF - Percent (%)",null,9,null,0,null,null,"  Unacceptable",null,null,null,"Target ",null,null,null,null,null,null,null,null,null,null,"Theoretical",null,-4,null,null,null,0,null,null,"  Unacceptable"]
[null,null,null,null,null,null,null,null,null,null,null,null,null,null,null,null,null,null,null,null,null,null,null,null,"3 Million ESALS or more - 5% ",null,null,null,null,null,null,null,null,null,"                            PAYFACTOR FOR UNIFORM STRENGTH >4 % BETWEEN HIGHEST & LOWEST TESTS =",null,null,null,null,null,null,null,null,null,0.98]
[null,null,null,null,null,null,null,null,null,null,null,null,null,null,null,null,null,null,null,null,null,null,null,null,"0.3 to 3 Million ESALS   - 4% "]
{"$rows_left_out":72}
{"sheet":"Instructions","index":7,"n_rows":88,"n_cols":3,"rows_kept":88,"cut":false,"hidden":false,"merged":[]}
[" REQUIRED DATA FOR CALCULATIONS:  (Enter on Sublot 1 Tab only)",null,"Information:"]
[]
["Enter project information in the header cells B6 to L8.",null,"All data in blue text with yellow background is test data entry."]
[]
["Enter JMF gradations in cells C16 to C27."]
[]
["Enter JMF AC content in cell C29."]
[]
["Enter Tons for this Test Report in cell I9"]
[]
{"$rows_left_out":79}
{"sheet":"Disclaimer","index":8,"n_rows":18,"n_cols":1,"rows_kept":18,"cut":false,"hidden":false,"merged":[]}
["By using this file, you are agreeing to this License Agreement:"]
[]
["The Oklahoma Department of Transportation (ODOT) does not provide technical support with respect to these files. Read the following disclaimer for terms of use pior to using this file."]
[]
[]
["ODOT makes no warranty of any kind, express or implied, with respect to any file. ODOT makes no warranty that any file is marketable or fit for any particular purpose. A description of a file shall not be deemed to create an express warranty that the file conforms to that description. You agree to accept the files in the format provided."]
[]
[]
["You assume all risk and liability for any losses, damages, claims, or expenses resulting from the use or possession of any file."]
[]
{"$rows_left_out":8}